{"text_format":"1","workbook":"xlsx","n_sheets":5,"sheets":["Foglio1","Foglio2","Foglio3","Foglio4","Foglio5"],"not_rendered":{"charts":0,"images":0,"macros":1,"external_links":0,"defined_names":4,"comments":1,"pivot_tables":0},"unopened":[],"bounds":{"document_bytes":16777216,"sheet_cells":100000,"rows_first":2000,"rows_last":500,"rows_between":2000,"halvings":0,"cell_chars":16384,"cell_head_chars":4096},"cells_cut":0,"cells_raw":0,"read":"whole","date_system":"1900"}

{"sheet":"Foglio1","index":0,"n_rows":16,"n_cols":20,"rows_kept":16,"cut":false,"hidden":false,"merged":[[1,2,1,4],[1,6,1,9],[3,6,5,9],[8,6,10,9],[15,6,15,9]]}
[null,null,null,null,null,null,null,null,null,null,null,null,"Cognome",null,"Nome",null,null,"Data/Sesso","Luogo","Controllo"]
[null,null,"CALCOLO CODICE FISCALE"]
[null,null,null,null,null,null,"Associazione Sportiva Dilettantistica"]
[null,null,null,null,"M",null,"TEAM KARATE ORTANI"]
[null,null,null,null,"F"]
[null,null,"Cognome:",null,{"$f":"Foglio4!X17","v":0},null,null,null,null,null,null,null,{"$f":"MID(CONCATENATE(SUBSTITUTE(SUBSTITUTE(SUBSTITUTE(SUBSTITUTE(SUBSTITUTE(SUBSTITUTE(SUBSTITUTE(UPPER(E6),\" \",\"\"),\"A\",\"\"),\"E\",\"\"),\"I\",\"\"),\"O\",\"\"),\"U\",\"\"),\"'\",\"\"),N6,\"XXX\"),1,3)","v":"00X"},{"$f":"SUBSTITUTE(SUBSTITUTE(SUBSTITUTE(SUBSTITUTE(SUBSTITUTE(SUBSTITUTE(SUBSTITUTE(SUBSTITUTE(SUBSTITUTE(SUBSTITUTE(SUBSTITUTE(SUBSTITUTE(SUBSTITUTE(SUBSTITUTE(SUBSTITUTE(SUBSTITUTE(SUBSTITUTE(SUBSTITUTE(SUBSTITUTE(SUBSTITUTE(SUBSTITUTE(SUBSTITUTE(SUBSTITUTE(UPPER(E6),\" \",\"\"),\"B\",\"\"),\"C\",\"\"),\"D\",\"\"),\"F\",\"\"),\"G\",\"\"),\"H\",\"\"),\"J\",\"\"),\"K\",\"\"),\"L\",\"\"),\"M\",\"\"),\"N\",\"\"),\"P\",\"\"),\"Q\",\"\"),\"R\",\"\"),\"S\",\"\"),\"T\",\"\"),\"V\",\"\"),\"W\",\"\"),\"X\",\"\"),\"Y\",\"\"),\"Z\",\"\"),\"'\",\"\")","v":"0"},{"$f":"IF(LEN(P6)>3,CONCATENATE(MID(P6,1,1),MID(P6,3,2)),MID(CONCATENATE(P6,Q6),1,3))","v":"00X"},{"$f":"SUBSTITUTE(SUBSTITUTE(SUBSTITUTE(SUBSTITUTE(SUBSTITUTE(SUBSTITUTE(SUBSTITUTE(UPPER(E8),\" \",\"\"),\"A\",\"\"),\"E\",\"\"),\"I\",\"\"),\"O\",\"\"),\"U\",\"\"),\"'\",\"\")","v":"0"},{"$f":"CONCATENATE(SUBSTITUTE(SUBSTITUTE(SUBSTITUTE(SUBSTITUTE(SUBSTITUTE(SUBSTITUTE(SUBSTITUTE(SUBSTITUTE(SUBSTITUTE(SUBSTITUTE(SUBSTITUTE(SUBSTITUTE(SUBSTITUTE(SUBSTITUTE(SUBSTITUTE(SUBSTITUTE(SUBSTITUTE(SUBSTITUTE(SUBSTITUTE(SUBSTITUTE(SUBSTITUTE(SUBSTITUTE(UPPER(E8),\" \",\"\"),\"B\",\"\"),\"C\",\"\"),\"F\",\"\"),\"G\",\"\"),\"H\",\"\"),\"J\",\"\"),\"K\",\"\"),\"L\",\"\"),\"M\",\"\"),\"N\",\"\"),\"P\",\"\"),\"Q\",\"\"),\"R\",\"\"),\"S\",\"\"),\"T\",\"\"),\"V\",\"\"),\"W\",\"\"),\"X\",\"\"),\"Y\",\"\"),\"Z\",\"\"),\"'\",\"\"),\"XXX\")","v":"0XXX"},{"$f":"CONCATENATE(RIGHT(YEAR(E12),2),VLOOKUP(MONTH(E12),Foglio2!$A$2:$B$13,2),IF(E10=\"M\",TEXT(E12,\"GG\"),DAY(E12)+40))","v":"00A40"},{"$f":"VLOOKUP(E14,Foglio2!$E$2:$G$8376,3,FALSE)","v":{"$error":"#N/A"}},{"$f":"VLOOKUP(TEXT(MOD(VLOOKUP(MID(M6,1,1),dispari,2)+VLOOKUP(MID(M6,2,1),pari,2)+VLOOKUP(MID(M6,3,1),dispari,2)+VLOOKUP(MID(O6,1,1),pari,2)+VLOOKUP(MID(O6,2,1),dispari,2)+VLOOKUP(MID(O6,3,1),pari,2)+VLOOKUP(MID(R6,1,1),dispari,2)+VLOOKUP(MID(R6,2,1),pari,2)+VLOOKUP(MID(R6,3,1),dispari,2)+VLOOKUP(MID(R6,4,1),pari,2)+VLOOKUP(MID(R6,5,1),dispari,2)+VLOOKUP(MID(S6,1,1),pari,2)+VLOOKUP(MID(S6,2,1),dispari,2)+VLOOKUP(MID(S6,3,1),pari,2)+VLOOKUP(MID(S6,4,1),dispari,2),26),0),controllo,2)","v":{"$error":"#N/A"}}]
[]
[null,null,"Nome:",null,{"$f":"Foglio4!W15","v":0}]
[null,null,null,null,null,null,{"$f":"IFERROR(CONCATENATE(M6,O6,R6,S6,T6),\"\")","v":""}]
[null,null,"Sesso:",null,{"$f":"Foglio4!AL22","v":0}]
[]
[null,null,"Data di Nascita:",null,{"$f":"Foglio4!AB22","v":"00:00:00"}]
[null,null,null,null,"Formato: usare trattino (-)."]
[null,null,"Luogo di Nascita:",null,{"$f":"Foglio4!Z19","v":0}]
[]
[null,null,null,null,null,null,"Premere il tasto Invio per il calcolo Codice Fiscale"]

{"sheet":"Foglio2","index":1,"n_rows":8376,"n_cols":7,"rows_kept":8376,"cut":false,"hidden":false,"merged":[]}
["MESI","LETTERA",null,null,"Comune","Provincia","Codice"]
[1,"A",null,null,"abano terme","PD","A001"]
[2,"B",null,null,"abbadia cerreto","LO","A004"]
[3,"C",null,null,"abbadia lariana","LC","A005"]
[4,"D",null,null,"abbadia san salvatore","SI","A006"]
[5,"E",null,null,"abbasanta","OR","A007"]
[6,"H",null,null,"abbateggio","PE","A008"]
[7,"L",null,null,"abbiategrasso","MI","A010"]
[8,"M",null,null,"abetone","PT","A012"]
[9,"P",null,null,"abriola","PZ","A013"]
[10,"R",null,null,"acate","RG","A014"]
[11,"S",null,null,"accadia","FG","A015"]
[12,"T",null,null,"acceglio","CN","A016"]
[null,null,null,null,"accettura","MT","A017"]
[null,null,null,null,"acciano","AQ","A018"]
[null,null,null,null,"accumoli","RI","A019"]
[null,null,null,null,"acerenza","PZ","A020"]
[null,null,null,null,"acerno","SA","A023"]
[null,null,null,null,"acerra","NA","A024"]
[null,null,null,null,"aci bonaccorsi","CT","A025"]
[null,null,null,null,"aci castello","CT","A026"]
[null,null,null,null,"aci catena","CT","A027"]
[null,null,null,null,"aci sant'antonio","CT","A029"]
[null,null,null,null,"acireale","CT","A028"]
[null,null,null,null,"acquacanina","MC","A031"]
[null,null,null,null,"acquafondata","FR","A032"]
[null,null,null,null,"acquaformosa","CS","A033"]
[null,null,null,null,"acquafredda","BS","A034"]
[null,null,null,null,"acqualagna","PU","A035"]
[null,null,null,null,"acquanegra cremonese","CR","A039"]
[null,null,null,null,"acquanegra sul chiese","MN","A038"]
[null,null,null,null,"acquapendente","VT","A040"]
[null,null,null,null,"acquappesa","CS","A041"]
[null,null,null,null,"acquarica del capo","LE","A042"]
[null,null,null,null,"acquaro","VV","A043"]
[null,null,null,null,"acquasanta terme","AP","A044"]
[null,null,null,null,"acquasparta","TR","A045"]
[null,null,null,null,"acquaviva collecroce","CB","A050"]
[null,null,null,null,"acquaviva d'isernia","IS","A051"]
[null,null,null,null,"acquaviva delle fonti","BA","A048"]
[null,null,null,null,"acquaviva picena","AP","A047"]
[null,null,null,null,"acquaviva platani","CL","A049"]
[null,null,null,null,"acquedolci","ME","M211"]
[null,null,null,null,"acqui terme","AL","A052"]
[null,null,null,null,"acri","CS","A053"]
[null,null,null,null,"acuto","FR","A054"]
[null,null,null,null,"adelfia","BA","A055"]
[null,null,null,null,"adrano","CT","A056"]
[null,null,null,null,"adrara san martino","BG","A057"]
[null,null,null,null,"adrara san rocco","BG","A058"]
[null,null,null,null,"adria","RO","A059"]
[null,null,null,null,"adro","BS","A060"]
[null,null,null,null,"affi","VR","A061"]
[null,null,null,null,"affile","RM","A062"]
[null,null,null,null,"afghanistan","EE","Z200"]
[null,null,null,null,"afragola","NA","A064"]
[null,null,null,null,"africo","RC","A065"]
[null,null,null,null,"agazzano","PC","A067"]
[null,null,null,null,"agerola","NA","A068"]
[null,null,null,null,"aggius","SS","A069"]
[null,null,null,null,"agira","EN","A070"]
[null,null,null,null,"agliana","PT","A071"]
[null,null,null,null,"agliano terme","AT","A072"]
[null,null,null,null,"aglie'","TO","A074"]
[null,null,null,null,"aglientu","SS","H848"]
[null,null,null,null,"agna","PD","A075"]
[null,null,null,null,"agnadello","CR","A076"]
[null,null,null,null,"agnana calabra","RC","A077"]
[null,null,null,null,"agnone","IS","A080"]
[null,null,null,null,"agnosine","BS","A082"]
[null,null,null,null,"agordo","BL","A083"]
[null,null,null,null,"agosta","RM","A084"]
[null,null,null,null,"agra","VA","A085"]
[null,null,null,null,"agrate brianza","MI","A087"]
[null,null,null,null,"agrate conturbia","NO","A088"]
[null,null,null,null,"agrigento","AG","A089"]
[null,null,null,null,"agropoli","SA","A091"]
[null,null,null,null,"agugliano","AN","A092"]
[null,null,null,null,"agugliaro","VI","A093"]
[null,null,null,null,"aicurzio","MI","A096"]
{"$rows_left_out":8297}
{"sheet":"Foglio3","index":2,"n_rows":38,"n_cols":8,"rows_kept":38,"cut":false,"hidden":false,"merged":[[0,0,0,1],[0,3,0,4],[0,6,0,7]]}
["CARATTERI DISPARI",null,null,"CARATTERI PARI",null,null,"CODICE DI CONTROLLO"]
["CARATTERE","VALORE",null,"CARATTERE","VALORE",null,"RESTO","LETTERA"]
["0",1,null,"0",0,null,"0","A"]
["1",0,null,"1",1,null,"1","B"]
["2",5,null,"2",2,null,"10","K"]
["3",7,null,"3",3,null,"11","L"]
["4",9,null,"4",4,null,"12","M"]
["5",13,null,"5",5,null,"13","N"]
["6",15,null,"6",6,null,"14","O"]
["7",17,null,"7",7,null,"15","P"]
["8",19,null,"8",8,null,"16","Q"]
["9",21,null,"9",9,null,"17","R"]
["A",1,null,"A",0,null,"18","S"]
["B",0,null,"B",1,null,"19","T"]
["C",5,null,"C",2,null,"2","C"]
["D",7,null,"D",3,null,"20","U"]
["E",9,null,"E",4,null,"21","V"]
["F",13,null,"F",5,null,"22","W"]
["G",15,null,"G",6,null,"23","X"]
["H",17,null,"H",7,null,"24","Y"]
["I",19,null,"I",8,null,"25","Z"]
["J",21,null,"J",9,null,"3","D"]
["K",2,null,"K",10,null,"4","E"]
["L",4,null,"L",11,null,"5","F"]
["M",18,null,"M",12,null,"6","G"]
["N",20,null,"N",13,null,"7","H"]
["O",11,null,"O",14,null,"8","I"]
["P",3,null,"P",15,null,"9","J"]
["Q",6,null,"Q",16]
["R",8,null,"R",17]
["S",12,null,"S",18]
["T",14,null,"T",19]
["U",16,null,"U",20]
["V",10,null,"V",21]
["W",22,null,"W",22]
["X",25,null,"X",23]
["Y",24,null,"Y",24]
["Z",23,null,"Z",25]

{"sheet":"Foglio4","index":3,"n_rows":79,"n_cols":39,"rows_kept":79,"cut":false,"hidden":false,"merged":[[61,20,64,37],[63,9,63,13],[63,1,63,4],[63,5,63,7],[63,14,63,18],[53,1,53,2],[53,3,53,8],[54,3,54,8],[48,20,51,37],[58,29,58,31],[50,8,50,12],[48,9,48,11],[60,21,60,27],[55,1,55,2],[55,3,55,18],[75,11,75,18],[73,9,73,11],[65,16,65,18],[67,3,67,7],[71,1,71,7],[71,8,71,18],[67,1,67,2],[67,8,67,18],[69,1,69,6],[69,9,69,11],[69,15,69,18],[65,1,65,3],[65,4,65,14],[73,1,73,3],[73,4,73,7],[35,22,35,29],[6,23,6,37],[53,9,53,11],[53,12,53,18],[38,1,38,18],[39,1,40,18],[41,1,42,18],[52,13,52,18],[37,32,37,35],[36,30,36,37],[42,20,43,37],[43,1,43,4],[38,20,38,37],[39,20,40,37],[2,1,37,18],[45,11,45,12],[45,14,45,18],[45,3,45,9],[43,12,43,18],[43,5,43,11],[44,5,44,11],[44,12,44,18],[45,32,45,37],[46,23,46,28],[0,20,0,37],[1,20,2,37],[8,20,10,37],[5,20,5,22],[16,23,16,37],[21,25,21,26],[5,23,5,37],[32,22,32,29],[34,22,34,29],[14,22,14,37],[21,27,21,29],[23,25,23,37],[25,31,25,37],[25,23,25,29],[27,36,27,37],[27,24,27,34],[29,22,29,37],[21,35,21,36],[18,25,18,37],[24,25,24,37],[19,25,19,37],[26,23,26,37],[3,20,3,37],[22,26,22,30],[0,1,1,18],[71,20,73,37],[75,32,75,34],[74,30,74,36],[14,20,14,21],[16,20,16,22],[18,20,18,24],[23,20,23,24],[25,20,25,21],[27,20,27,22],[29,20,29,21],[32,20,32,21],[34,20,34,21],[68,22,68,24],[68,28,68,29],[68,30,68,37],[58,23,58,28],[58,32,58,37],[59,23,59,28],[56,1,62,18],[55,22,55,24],[55,30,55,37],[55,28,55,29],[45,23,45,28],[45,29,45,31],[45,1,45,2],[49,1,49,2],[51,11,51,12],[49,9,49,11],[51,13,51,18],[51,1,51,2],[47,10,47,11],[47,12,47,13],[47,14,47,18],[47,3,47,8],[49,14,49,18],[49,3,49,7],[47,1,47,2],[49,12,49,13],[51,4,51,6],[51,7,51,10],[47,21,47,27]]}
[null,"INFORMATIVA PER TRATTAMENTO DI DATI PERSONALI E SENSIBILI\nDocumento informativo ai sensi e per gli effetti di cui all’articolo 13, D. Lgs. 30 giugno 2003 n. 196 ",null,null,null,null,null,null,null,null,null,null,null,null,null,null,null,null,null,null,"Associazione Sportiva Dilettantistica"]
[null,null,null,null,null,null,null,null,null,null,null,null,null,null,null,null,null,null,null,null,"TEAM KARATE ORTANI"]
[null,"In osservanza di quanto previsto dal D. Lgs. 30 giugno 2003 n. 196, vengono di seguito fornite le dovute informazioni in merito alle finalità ed alle modalità di trattamento dei Suoi/Vostri dati personali, all’ambito di comunicazione e diffusione degli stessi, alla natura dei dati in possesso della Società Sportiva (di seguito solo società) e del loro conferimento.\nFinalità del trattamento:\nI Vostri dati vengono/verranno trattati in relazione alle proprie esigenze organizzative ed ai compiti istituzionali attribuiti dalla legge, dai regolamenti, dalla normativa comunitaria, dalle Carte Federali inerenti all’organizzazione e la gestione delle attività previste per statuto dalla società.\nIl trattamento dei dati avverrà per tutta la durata del rapporto ed anche successivamente, per l’espletamento di obblighi di legge e per finalità amministrative e promozionali relative alla gestione dei tesserati.\nIn particolare la finalità del trattamento è strettamente connessa all’organizzazione di attività tese a promuovere, diffondere, migliorare la tecnica e la tattica degli Atleti nel settore dilettantistico e giovanile nonché alla propaganda delle varie discipline attraverso anche attività di volantinaggio fatto a fini pubblicitari, pubblicazioni sul sito internet della società, realizzazione di DVD dimostrativi e calendari sociali.\nModalità del trattamento:\nI Vostri dati saranno trattati nel rispetto della Legge sulla privacy per le esigenze su esposte e saranno trattati tramite supporti cartacei e strumenti informatici ed eventualmente audiovisivi, ma sempre e comunque ad opera di soggetti appositamente incaricati con logiche strettamente correlate alle finalità stesse.\nAmbito di comunicazione e diffusione:\nI Vostri dati potranno essere da noi \"comunicati\", con tale termine intendendosi il darne conoscenza ad uno o più soggetti determinati, nei seguenti termini:\n●   a soggetti incaricati di trattare i dati all’interno della nostra società (collaboratori e dipendenti);\n●   b seguito di obbligo di legge/ispezioni/verifiche all’autorità giudiziaria, ad organi di polizia, o ad altre\n     Amministrazioni Pubbliche per gli adempimenti normativi richiesti, ed in genere a tutti gli organi preposti     \n     a verifiche e controlli circa la regolarità degli adempimenti di cui alle finalità anzi indicate.\nInoltre la società potrebbe diffondere i dati personali al pubblico, a titolo esemplificativo oppure propagandistico, sul sito internet, su pubblicazioni locali o nazionali, realizzando DVD-Video, volantini o calendari.\nIn occasione dei trattamenti la società potrà venire a conoscenza di dati che il D. Lgs. 196/2003 definisce “sensibili”, in quanto idonei a rivelare lo stato di salute, adesione a sindacati, convinzioni religiose e filosofiche e per il trattamento dei quali la legge prevede una specifica manifestazione di consenso da parte dell’interessato.\nLa informiamo inoltre che la società potrebbe diffondere i suoi dati personali sensibili al pubblico, a titolo esemplificativo oppure propagandistico, sul sito internet, su pubblicazioni locali o nazionali, realizzando DVD-Video, volantini o calendari.\nNatura del conferimento:\nLa informiamo che senza il suo consenso scritto alle predette comunicazioni e diffusioni, la società potrà effettuare solo quelle attività che non prevedono tali comunicazioni.\nDiritti di cui all’art. 7  del Decreto Legislativo n. 196/2003.\nIn ogni momento Lei lo desideri potrà esercitare i diritti previsti dall’articolo 7 D. Lgs. N. 196/2003, che in questa sede si intende integralmente richiamato, ed in particolare i diritti di conoscere l’esistenza di trattamenti di dati che possono riguardarla, nonché richiedere al Titolare o al Responsabile del trattamento l’aggiornamento/rettifica/integrazione dei dati ed anche la cancellazione/trasformazione in forma anonima o blocco dei dati trattati contro la legge, nonché l’attestazione che le menzionate operazioni siano portate a conoscenza di coloro ai quali i dati sono stati comunicati o diffusi.\nOpporsi, in tutto o in parte, per motivi legittimi, al trattamento dei dati che Lo riguardano.\nOpporsi, in tutto o in parte, al trattamento dei dati previsto a fini propagandistici.\nSi rende noto, inoltre che, l’eventuale non comunicazione, o comunicazione errata, di una delle informazioni obbligatorie, ha come conseguenze emergenti l’impossibilità del titolare di garantire la congruità del trattamento stesso alle finalità per cui esso sia eseguito.\nL’interessato potrà far valere i suoi diritti come espressi dagli art. 7, 8, 9 e 10 del D. Lgs. 30 giugno 2003 n. 196, rivolgendosi al titolare (oppure al responsabile, se nominato) del trattamento.\nIl titolare del trattamento è la società sportiva TEAM KARATE ORTANI.\nPartita I.V.A. 01848830681, con sede in Montesilvano del comune di Montesilvano provincia di Pescara nella persona del suo legale rappresentante.\nIl responsabile del trattamento è il sig. Ortani Walter.\n"]
[null,null,null,null,null,null,null,null,null,null,null,null,null,null,null,null,null,null,null,null,"N.B. I dati vanno inseriti con formato tutto maiuscole."]
[]
[null,null,null,null,null,null,null,null,null,null,null,null,null,null,null,null,null,null,null,null,"TESSERATO",null,null,{"$f":"CONCATENATE(X17,\" \",W15)","v":" "}]
[null,null,null,null,null,null,null,null,null,null,null,null,null,null,null,null,null,null,null,null,null,null,null,"Cognome e Nome"]
[]
[null,null,null,null,null,null,null,null,null,null,null,null,null,null,null,null,null,null,null,null,"AI FINI DELLA DEDUCIBILITA’ FISCALE, COMUNICARE A CHI INTESTARE LE RICEVUTE EMESSE ALL’ASSOCIAZIONE SPORTIVA DILETTANTISTICA TEAM KARATE ORTANI:\n"]
[]
[]
[]
[null,null,null,null,null,null,null,null,null,null,null,null,null,null,null,null,null,null,null,null,"DATI ANAGRAFICI\n"]
[]
[null,null,null,null,null,null,null,null,null,null,null,null,null,null,null,null,null,null,null,null,"NOME"]
[]
[null,null,null,null,null,null,null,null,null,null,null,null,null,null,null,null,null,null,null,null,"COGNOME"]
[]
[null,null,null,null,null,null,null,null,null,null,null,null,null,null,null,null,null,null,null,null,"LUOGO DI NASCITA"]
[null,null,null,null,null,null,null,null,null,null,null,null,null,null,null,null,null,null,null,null,null,null,null,null,null,"Se non Italiano/a, sostituire il \"Luogo di Nascita\" con lo \"Stato di Nascita\"."]
[]
[null,null,null,null,null,null,null,null,null,null,null,null,null,null,null,null,null,null,null,null,null,null,null,null,null,"DATA",null,null,null,null,null,null,null,"M","F","SESSO"]
[null,null,null,null,null,null,null,null,null,null,null,null,null,null,null,null,null,null,null,null,null,null,null,null,null,null,"Formato: usare trattino (-)."]
[null,null,null,null,null,null,null,null,null,null,null,null,null,null,null,null,null,null,null,null,"CODICE FISCALE",null,null,null,null,{"$f":"Foglio1!G9","v":""}]
[]
[null,null,null,null,null,null,null,null,null,null,null,null,null,null,null,null,null,null,null,null,"E-MAIL",null,null,null,null,null,null,null,null,null,"@"]
[null,null,null,null,null,null,null,null,null,null,null,null,null,null,null,null,null,null,null,null,null,null,null,"Il dato va inserito con formato valido."]
[null,null,null,null,null,null,null,null,null,null,null,null,null,null,null,null,null,null,null,null,"INDIRIZZO",null,null,null,null,null,null,null,null,null,null,null,null,null,null,"N° "]
[]
[null,null,null,null,null,null,null,null,null,null,null,null,null,null,null,null,null,null,null,null,"CITTA’"]
[]
[]
[null,null,null,null,null,null,null,null,null,null,null,null,null,null,null,null,null,null,null,null,"LUOGO",null,null,null,null,null,null,null,null,null,null,"CITTA' SANT'ANGELO","MONTESILVANO"]
[]
[null,null,null,null,null,null,null,null,null,null,null,null,null,null,null,null,null,null,null,null,"DATA "]
[null,null,null,null,null,null,null,null,null,null,null,null,null,null,null,null,null,null,null,null,null,null,"Formato: usare trattino (-)."]
[]
[null,null,null,null,null,null,null,null,null,null,null,null,null,null,null,null,null,null,null,null,null,null,null,null,null,null,null,null,null,null,null,null,"FIRMA"]
[null,"Associazione Sportiva Dilettantistica",null,null,null,null,null,null,null,null,null,null,null,null,null,null,null,null,null,null,"Associazione Sportiva Dilettantistica"]
[null,"TEAM KARATE ORTANI",null,null,null,null,null,null,null,null,null,null,null,null,null,null,null,null,null,null,"TEAM KARATE ORTANI"]
[]
[null,"MODULO DI ADESIONE\n"]
[null,null,null,null,null,null,null,null,null,null,null,null,null,null,null,null,null,null,null,null,"CONSENSO"]
[null,"Il/la sottoscritto/a ",null,null,null,{"$f":"X17","v":0},null,null,null,null,null,null,{"$f":"W15","v":0}]
[null,null,null,null,null,"Cognome",null,null,null,null,null,null,"Nome"]
[null,"Indirizzo",null,{"$f":"Y28","v":0},null,null,null,null,null,null,"N°",{"$f":"AK28","v":0},null,"Città",{"$f":"W30","v":0},null,null,null,null,null,"Il sottoscritto",null,null,{"$f":"CONCATENATE(X17,\" \",W15)","v":" "},null,null,null,null,null,"residente a",null,null,{"$f":"W30","v":0}]
[]
[null,"Comune",null,null,null,null,null,null,null,"Cap",null,null,"Provincia",null,null,null,null,null,null,null,"in",{"$f":"CONCATENATE(Y28,\", \",AK28)","v":", "},null,null,null,null,null,null,"in qualità di interessato, con la firma apposta alla "]
[null,null,null,null,null,null,null,null,null,null,null,null,null,null,null,null,null,null,null,null,"presente attesta il proprio libero consenso affinché titolare e responsabile procedano al trattamento dei propri dati personali cosiddetti comuni e alla loro comunicazione e diffusione nell’ambito dei soggetti indicati nell’informativa e per le finalità indicate sia in Italia che all’estero.\n"]
[null,"Nato a",null,{"$f":"Z19","v":0},null,null,null,null,"Il",{"$f":"IF(AB22,AB22,\"\")","v":""},null,null,"Provincia"]
[]
[null,"Sesso",null,{"$f":"AL22","v":0},"di Nazionalità ",null,null,null,null,null,null,"Telefono"]
[null,null,null,null,null,null,null,null,null,null,null,null,null,"Formato: usare trattino (-)."]
[null,"Cellulare",null,null,null,null,null,null,null,"Di professione"]
[null,null,null,"Formato: usare trattino (-)."]
[null,"Altro",null,null,null,null,null,null,null,null,null,null,null,null,null,null,null,null,null,null,null,"Data",{"$f":"IF(W35,W35,\"\")","v":""},null,null,null,null,null,"FIRMA"]
[null,"Chiede di essere iscritto/a all’Associazione Sportiva Dilettantistica TEAM KARATE ORTANI. Dichiara di aver preso visione dello Statuto e del Regolamento dell’associazione, dello Statuto e dei Regolamenti (di una eventuale Federazione Nazionale o Ente di Promozione Sportiva alla quale è iscritta l’Associazione), nonchè dell’informativa sulla Privacy allegata e di accettarli incondizionatamente, assumendosi ogni responsabilità civile e penale derivante da eventuali danni provocati a persone, animali e cose, sia involontariamente che per infrazione alle norme emanate dagli Statuti e Regolamenti sopra citati."]
[]
[null,null,null,null,null,null,null,null,null,null,null,null,null,null,null,null,null,null,null,null,"Il sottoscritto",null,null,{"$f":"X46","v":" "},null,null,null,null,null,"residente a",null,null,{"$f":"AG46","v":0}]
[]
[null,null,null,null,null,null,null,null,null,null,null,null,null,null,null,null,null,null,null,null,"in",{"$f":"V48","v":", "},null,null,null,null,null,null,"in qualità di interessato, con la firma apposta alla "]
[null,null,null,null,null,null,null,null,null,null,null,null,null,null,null,null,null,null,null,null,"presente attesta il proprio libero consenso affinché titolare e responsabile procedano al trattamento dei propri dati personali cosiddetti sensibili e alla loro comunicazione e diffusione nell’ambito dei soggetti indicati nell’informativa e per le finalità indicate sia in Italia che all’estero.\n"]
[]
[null,"Data versamento",null,null,null,{"$f":"IF(W35,W35,\"\")","v":""},null,null,null,"Quota di iscrizione"]
[]
[null,"Luogo e data",null,null,{"$f":"W33","v":0},null,null,null,null,null,null,null,null,null,null,null,{"$f":"IF(W35,W35,\"\")","v":""}]
[]
[null,"In Fede"]
[null,null,null,null,null,null,null,null,null,null,null,null,null,null,null,null,null,null,null,null,null,"Data",{"$f":"W56","v":""},null,null,null,null,null,"FIRMA"]
[null,"Decisione dell’Associazione\n",null,null,null,null,null,null,"X","AMMESSO",null,null,null,null,null,"NON AMMESSO"]
[]
[null,"Se non ammesso dettaglio motivi",null,null,null,null,null,null,null,null,null,null,null,null,null,null,null,null,null,null,"In mancanza di idonea certificazione medica si mette a conoscenza che il tesserato non usufruirà della copertura assicurativa. Inoltre, in mancanza di codesto certificato l’A.S.D. Team Karate Ortani non si assume nessuna responsabilità.\n"]
[]
[null,"Luogo e data",null,null,"Montesilvano"]
[]
[null,null,null,null,null,null,null,null,null,null,null,"Il Presidente o il Legale Rappresentante",null,null,null,null,null,null,null,null,null,null,null,null,null,null,null,null,null,null,null,null,"FIRMA"]
[null,"Cognome",null,"Nome",null,"Indirizzo",null,"Località",null,"Comune ",null,"C. A. P.",null,"Provincia",null,"Nazionalità",null,"Telefono",null,"Luogo e Comune di nascita",null,"Provincia di nascita ",null,"Data di nascita ",null,"Sesso","C.F.","Grado","Taglia","Data Grado","C. Kumite","Cognome e Nome Genitore","Peso","Codice fiscale","Budo","Qualifica Tecnico","Email","Data Tecnico","E.D.P."]
[]
[null,{"$f":"F44","v":0},null,{"$f":"M44","v":0},null,{"$f":"CONCATENATE(D46,\", \",L46)","v":"0, 0"},null,{"$f":"O46","v":0},null,{"$f":"D48","v":0},null,{"$f":"K48","v":0},null,{"$f":"O48","v":0},null,{"$f":"H52","v":0},null,{"$f":"CONCATENATE(N52,\" \",D54)","v":" "},null,{"$f":"D50","v":0},null,{"$f":"O50","v":0},null,{"$f":"J50","v":""},null,{"$f":"SUBSTITUTE(SUBSTITUTE(D52,\"M\",\"MASCHILE\"),\"F\",\"FEMMINILE\")","v":"0"},{"$f":"Z24","v":""},"01) BIANCA",null,{"$f":"W35","v":"00:00:00"},null,{"$f":"CONCATENATE(X17,\" \",W15)","v":" "},null,{"$f":"Z24","v":""},null,null,{"$f":"CONCATENATE(X26,\"@\",AF26)","v":"@"},null,"F.I.K."]

{"sheet":"Foglio5","index":4,"n_rows":3,"n_cols":39,"rows_kept":3,"cut":false,"hidden":false,"merged":[[0,1,1,38]]}
[null,"LISTA DATI"]
[]
[null,"Cognome",null,"Nome",null,"Indirizzo",null,"Località",null,"Comune ",null,"C. A. P.",null,"Provincia",null,"Nazionalità",null,"Telefono",null,"Luogo e Comune di nascita",null,"Provincia di nascita ",null,"Data di nascita ",null,"Sesso",null,"Grado","Taglia","Data Grado","C. Kumite","Cognome e Nome Genitore","Peso","Codice fiscale","Budo","Qualifica Tecnico","Email","Data Tecnico","E.D.P."]